{"text_format":"1","workbook":"xlsx","n_sheets":6,"sheets":["1. INSTRUCTIONS","2.Eligible and Ineligible Costs","3. Budget - Work Plan","4. Sources of Funding","5.Payment & reporting table","6. Expense Claim"],"not_rendered":{"charts":0,"images":0,"macros":1,"external_links":0,"defined_names":13,"comments":0,"pivot_tables":0},"unopened":[],"bounds":{"document_bytes":16777216,"sheet_cells":100000,"rows_first":2000,"rows_last":500,"rows_between":2000,"halvings":0,"cell_chars":16384,"cell_head_chars":4096},"cells_cut":0,"cells_raw":0,"read":"whole","date_system":"1900"}

{"sheet":"1. INSTRUCTIONS","index":0,"n_rows":11,"n_cols":1,"rows_kept":11,"cut":false,"hidden":false,"merged":[]}
["WORK PLAN AND BUDGET – GMF plan, study or pilot project"]
["INSTRUCTIONS – PLEASE READ FIRST"]
["Macros: This template uses \"macros,\" which are groups of programmed instructions whose main pupose is to automate tasks. Macros trigger the appropriate clauses in this work plan and budget. To use all the features of this template you must enable macros in Excel. \nSaving the template: It is critical that you save the template correctly, otherwise the correct information may not be recorded. When you go to save your template, ensure that you save it as an \"Excel Macro-Enabled Workbook\" (*.xlsm)."]
["Tabs 1 through 4 must be read, understood and completed at the time of submitting an application to GMF. Tabs 4 through 6 must be updated as the initiative progresses and for every contribution requested from GMF. Note that tabs 5 and 6 will be provided only after your application is approved for funding because they are used to track your initiative's progress."]
["▪ MILESTONE: A milestone is a major deliverable indicating the completion of one or more tasks. Disbursements will be made upon completion of determined milestones. Examples include the following: \n            ▪ Reports, such as those conducted as part of a business process, management reports, council reports or formal progress reports  \n            ▪ Design drawings \n            ▪ Workshop participant lists\n            ▪ Council or management minutes\n            ▪ News articles\n            ▪ Training certificates \n            ▪ Provincial or municipal approvals (e.g., environmental approval, operating certificates, etc.)\n"]
["▪ START/END DATES: Enter the estimated start and end dates for each milestone. Note: FCM expects that, in most circumstances, funded initiatives must be completed within three years of the date of approval. This requirement will be noted in your agreement with FCM.\n"]
["▪ TASK: A task is defined as a single activity undertaken to achieve a milestone. For each task identified, provide a description of what the task entails, who will be completing the task and an estimate of the cost. Individual tasks should generally cost less than $50,000. Costs should be separated into eligible and ineligible categories. Refer to Eligible and Ineligible Costs (tab 2) for a list of costs that can be partially reimbursed by FCM."]
["▪ CONTINGENCY COSTS: Contingency costs are eligible, but cannot be listed as a separate budget item. Allocate contingency costs within the relevant budget items as and where appropriate, and add an explanation of the contingency percentage or amount in the “contingency costs” section below the work plan table."]
["▪ TAXES: You may include the portion of taxes for which your organization is not eligible for a rebate (provincial, territorial or federal) in your budget. Allocate this amount within the relevant tasks as and where appropriate."]
["▪ DELETING ROWS: Rows cannot be deleted because of the way the template is structured. Please leave extra or empty rows blank."]
["▪ INFORMATION TO UPDATE FOR EVERY CONTRIBUTION REQUEST: Please note that tabs 4 to 6 must be updated (where applicable) every time a contribution request is submitted to GMF. "]

{"sheet":"2.Eligible and Ineligible Costs","index":1,"n_rows":46,"n_cols":3,"rows_kept":46,"cut":false,"hidden":false,"merged":[]}
[null,"                                     Eligible and ineligible costs table"]
["                  If your application is approved, expenses that are eligible for partial reimbursement or advance payment must be:"]
["             – incurred after the date the application is received by FCM (costs to write the application incurred up to 90 days prior to receipt of the application by FCM);"]
["             – invoiced directly to your organization;"]
["             – an integral and an essential component of the initiative required to achieve the environmental objective; and"]
["             – actually and reasonably incurred in accordance with applicable industry standards."]
["FCM reserves the right to audit financial statements or expenses incurred at a future date. "]
["Please keep financial accounts and records for at least seven years. These include, but are not limited to, contracts, invoices, statements, receipts and vouchers."]
["Financial records, including labour costs, must be documented in a manner that meets audit standards and enables verification of cost eligibility and level of effort."]
["Cost category","Eligible costs","Ineligible costs"]
["                                                                                          Section A: Costs incurred prior to date application received by FCM"]
["(1)  Pre-application","Costs to write the GMF application incurred up to 90 days prior to application receipt date.","All other costs incurred prior to application receipt date."]
["                                                                                          Section B: Costs incurred after date application received by FCM"]
["(2)  Administrative","Administrative costs that are directly linked to and have been incurred for the project, such as:","Office space, supplies and general overhead costs incurred in the ordinary course of business."]
[null,"•         communication costs (e.g., long-distance calls) "]
[null,"•         permits or certifications required for the project"]
[null,"•         printing or photocopying by outside suppliers"]
[null,"•         acquisition of documents used exclusively for the project"]
[null,"•         document translation"]
["(3)  Advertising","Advertising costs essential to communicating the project to the public, as well as project evaluation, such as: ","•         Advertising costs for general education or publicity that is a result of ongoing or other business activity and not a specific requirement of the project"]
[null,"•         fees for advertising development","•         Promotional items"]
[null,"•         fees for media distribution"]
[null,"•         website development"]
[null,"•         public surveys"]
["(4)  Capital Expenditures (pilot projects only)","Rental or purchase of equipment or assets that are essential for conducting the small-scale activity. This would include specialized system hardware and software, construction costs, materials, renovation and modernization costs, and installation costs.","•         Any major capital costs"]
[null,null,"•         Purchase or lease of real property"]
["(5)  Equipment rental","Rental of tools and equipment related to the project.","Rental of tools or equipment related to ongoing or other business activities."]
["(6)  In-kind","N/A","Any goods and services that are received through donation or in-kind."]
["(7)  Meetings and public gatherings","Costs related to meetings and public gatherings held to communicate the project to the public and collect feedback, such as:","Any hospitality expenses, such as:"]
[null,"•         facility rental","•         food, drink and alcohol"]
{"$rows_left_out":17}
{"sheet":"3. Budget - Work Plan","index":2,"n_rows":172,"n_cols":8,"rows_kept":172,"cut":false,"hidden":false,"merged":[]}
["                                                                                                                                                                                            WORK PLAN AND BUDGET "]
["Lead applicant:",null,null,null,"Applicant type (select one)"]
["Project title:",null,null,null,"Project type (select one)"]
["Milestones","Start date:","End date:","Cost category (select one)","Eligible cost ($)","Ineligible cost ($)","Total cost ($)"]
["Milestone 1: Please identify your first milestone","mm/yyyy","mm/yyyy"]
["Milestone description: [In this box, please describe the milestone or the major deliverable that indicates the completion of this milestone]"]
["[Add task description here]",null,null,null,null,null,{"$f":"E7+F7","v":0}]
["[Add task description here]",null,null,null,null,null,{"$f":"E8+F8","v":0}]
["[Add task description here]",null,null,null,null,null,0]
["[Add task description here]",null,null,null,null,null,0]
["[Add task description here]",null,null,null,null,null,0]
["[Add task description here]",null,null,null,null,null,0]
["[Add task description here]",null,null,null,null,null,0]
["[Add task description here]",null,null,null,null,null,{"$f":"E14+F14","v":0}]
["[Add task description here]",null,null,null,null,null,0]
["[Add task description here]",null,null,null,null,null,0]
["[Add task description here]",null,null,null,null,null,0]
["[Add task description here]",null,null,null,null,null,0]
["[Add task description here]",null,null,null,null,null,0]
["[Add task description here]",null,null,null,null,null,0]
["[Add task description here]",null,null,null,null,null,0]
["[Add task description here]",null,null,null,null,null,0]
["Subtotal",null,null,null,null,null,{"$f":"SUM(G7:OFFSET(G23,-1,0))","v":0},{"$f":"SUMIF((G5),\"=YES\",E23)","v":0}]
["Milestone 2: Please identify your second milestone","mm/yyyy","mm/yyyy"]
["Milestone description: [In this box, please describe the milestone or the major deliverable that indicates the completion of this milestone]"]
["[Add task description here]",null,null,null,null,null,{"$f":"E26+F26","v":0}]
["[Add task description here]",null,null,null,null,null,{"$f":"E27+F27","v":0}]
["[Add task description here]",null,null,null,null,null,0]
["[Add task description here]",null,null,null,null,null,0]
["[Add task description here]",null,null,null,null,null,0]
{"$rows_left_out":143}
{"sheet":"4. Sources of Funding","index":3,"n_rows":25,"n_cols":6,"rows_kept":25,"cut":false,"hidden":false,"merged":[]}
["INSTRUCTIONS\nEnter all funding sources for this initiative. For each funding source, please indicate the amount of funding and when the funding is confirmed or expected to be confirmed. The total of all funding sources must equal the total project costs in your Work Plan and Budget (tab 3). \nThe municipal government's cash contribution must be at least 10% of the eligible costs unless otherwise agreed upon by FCM. \nFCM will cap GMF grant amounts in accordance with other confirmed sources of funding.\n\nPlans and feasibility studies\nNote: FCM offers grants that cover up to 50% of eligible costs (to a maximum of $175,000) to undertake eligible plans and feasibility studies. \n\nPilot projects\nNote: FCM offers grants that cover up to 50% of eligible costs (to a maximum of $500,000) to undertake eligible pilot projects. Municipalities and municipal partners with a population of 20,000 or less may qualify for a pilot project grant of up to 80% of eligible project costs under certain conditions. Contact us to find out if your municipality is eligible. "]
["SOURCES OF FUNDING"]
["Funding source","Description","Confirmed? (Y/N)","Date committed\nDD-MM-YYYY","Amount","Percentage of total budget"]
["Green Municipal Fund","Grant","N",null,{"$f":"IF('3. Budget - Work Plan'!G3=\"Pilot Project\",IF(((0.5*'3. Budget - Work Plan'!G122)>500000),500000,0.5*'3. Budget - Work Plan'!G122),IF(((0.5*'3. Budget - Work Plan'!G122)>175000),175000,0.5*'3. Budget - Work Plan'!G122))","v":0},{"$f":"IFERROR(E4/$E$24,0)","v":0}]
[" Name of Lead Municipality ","Cash",null,null,null,0]
["Additional Funding Source",null,null,null,null,0]
["Additional Funding Source",null,null,null,null,0]
["Additional Funding Source",null,null,null,null,0]
["Additional Funding Source",null,null,null,null,0]
["Additional Funding Source",null,null,null,null,0]
["Additional Funding Source",null,null,null,null,0]
["Additional Funding Source",null,null,null,null,0]
["Additional Funding Source",null,null,null,null,0]
["Additional Funding Source",null,null,null,null,0]
["Additional Funding Source",null,null,null,null,0]
["Additional Funding Source",null,null,null,null,0]
["Additional Funding Source",null,null,null,null,0]
["Additional Funding Source",null,null,null,null,0]
["Additional Funding Source",null,null,null,null,0]
["Additional Funding Source",null,null,null,null,0]
["Additional Funding Source",null,null,null,null,0]
["[Total funding should equal total costs from tab 3.Budget -Work Plan ]",null,null,"Total funding:",{"$f":"SUM(E4:OFFSET(E22,-1,0))","v":0},0]
[]
[null,null," Total budget costs",null,{"$f":"'3. Budget - Work Plan'!G120","v":0}]
[null,null," Total budget eligible costs",null,{"$f":"'3. Budget - Work Plan'!G122","v":0}]

{"sheet":"5.Payment & reporting table","index":4,"n_rows":27,"n_cols":5,"rows_kept":27,"cut":false,"hidden":true,"merged":[[0,0,0,3],[2,3,5,3],[1,4,1,7],[16,1,26,1],[16,2,26,2],[2,1,5,2],[7,3,15,3],[16,3,26,3],[1,1,1,2],[7,1,15,1],[7,2,15,2]]}
["Payment and reporting table"]
["Contribution(s) and Deliverable(s)","Expected Date of Contribution",null,"The Contribution shall be equal to:","[EXAMPLE] Project Officer to insert customized table"]
["Advanced Contribution #1 ","Within 30 days of executed Agreement \n+\nreceipt of void cheque",null,"$INSERT AMOUNT CALCULATED AT TIME OF PROJECT APPROVAL"]
[]
["·         Executed Grant Agreement"]
["·         Void Cheque"]
["Contribution(s) and Deliverable(s)","Approximate Date of Submission","Approximate Date of Contribution","The Contribution shall be equal to the lesser of:"]
["Contribution  #2","INSERT DATE GMF EXPECTS TO RECEIVE COMPLETED REQUEST","INSERT DATE 30 DAYS AFTER SUBMISSION DATE","$INSERT COMBINED AMOUNT OF CONTRIBUTIONS 1 AND 2, THIS MUST BE A MAXIMUM OF 75% OF TOTAL GRANT  less the amount of previous Contributions; or \n\nINSERT 50 OR 80 AS IDENTIFIED IN APPROVAL% of Eligible Costs then incurred by the Recipient less the amount of previous Contributions"]
["·         Schedule D – Request for Contribution "]
["·         Schedule E – Project Progress Report"]
["·         Evidence that Milestones INSERT APPROPRIATE NUMBERS FROM THE WORKBOOK were completed: INSERT DELIVERABLES IDENTIFIED IN PROJECT WORKBOOK"]
["·         Updated Project Workbook"]
["o    Sources of Funding"]
["o    Payment and Reporting Schedule"]
["o    Expense Claim"]
["·         Additional conditions: INSERT ANY EXTRA CONDITIONS IMPOSED BY GMF STAFF OR GMF COUNCIL/FCM BOARD OR WRITE None "]
["Final Contribution ","INSERT DATE GMF EXPECTS TO RECEIVE COMPLETED REQUEST","INSERT DATE 30 DAYS AFTER SUBMISSION DATE","$INSERT TOTAL GRANT AMOUNT  less the amount of previous Contributions; or \n\nINSERT 50 OR 80 AS IDENTIFIED IN APPROVAL% of Eligible Costs then incurred by the Recipient less the amount of previous Contributions"]
["·         Schedule D – Request for Contribution "]
["·         Schedule F – Project Completion Report "]
["·         Evidence that Milestones INSERT APPROPRIATE NUMBERS FROM THE WORKBOOK were completed : INSERT DELIVERABLES IDENTIFIED IN PROJECT WORKBOOK"]
["·         Updated Project Workbook"]
["o    Sources of Funding"]
["o    Payment and Reporting Schedule"]
["o    Expense Claim"]
["·         Final  INSERT NAME OF FINAL DELIVERABLE (S)"]
["·         IF PLAN, INSERT ''Evidence of municipal council approval''"]
["·         Additional conditions: INSERT ANY EXTRA CONDITIONS IMPOSED BY GMF STAFF OR GMF COUNCIL/FCM BOARD OR WRITE None"]

{"sheet":"6. Expense Claim","index":5,"n_rows":141,"n_cols":13,"rows_kept":141,"cut":false,"hidden":true,"merged":[]}
["                                                                                                                                                                                                                                                                 Expense claim - GMF Initiatives"]
["Lead Applicant:",{"$f":"'3. Budget - Work Plan'!B2","v":0},null,null,null,null,"Indicate tax rebate rate ------->"]
["Project title:",{"$f":"'3. Budget - Work Plan'!B3","v":0}]
["                                                                                                                          Estimated budget costs (from tab 3. Budget - Workplan)",null,null,null,null,null,null,null,"                                                                                                                                                                    Actual budget costs"]
["Milestones","Start date:","End date:","Cost category","Eligible cost \n($)","Ineligible cost ($)","Total predicted cost \n($)",null,"Actual eligible cost (net of tax-rebate)","Actual ineligible cost (net of tax rebate)","Total actual costs \n(net of tax rebate)","Recipient comments","GMF comments"]
[{"$f":"'3. Budget - Work Plan'!A5","v":"Milestone 1: Please identify your first milestone"},{"$f":"'3. Budget - Work Plan'!B5","v":"mm/yyyy"},{"$f":"'3. Budget - Work Plan'!C5","v":"mm/yyyy"}]
[{"$f":"'3. Budget - Work Plan'!A6","v":"Milestone description: [In this box, please describe the milestone or the major deliverable that indicates the completion of this milestone]"}]
[{"$f":"'3. Budget - Work Plan'!A7:C7","v":"[Add task description here]"},null,null,{"$f":"'3. Budget - Work Plan'!D7","v":0},{"$f":"'3. Budget - Work Plan'!E7","v":0},{"$f":"'3. Budget - Work Plan'!F7","v":0},{"$f":"'3. Budget - Work Plan'!G7","v":0},null,null,null,{"$f":"I8+J8","v":0}]
[{"$f":"'3. Budget - Work Plan'!A8:C8","v":"[Add task description here]"},null,null,{"$f":"'3. Budget - Work Plan'!D8","v":0},{"$f":"'3. Budget - Work Plan'!E8","v":0},{"$f":"'3. Budget - Work Plan'!F8","v":0},{"$f":"'3. Budget - Work Plan'!G8","v":0},null,null,null,{"$f":"I9+J9","v":0}]
[{"$f":"'3. Budget - Work Plan'!A9:C9","v":"[Add task description here]"},null,null,{"$f":"'3. Budget - Work Plan'!D9","v":0},{"$f":"'3. Budget - Work Plan'!E9","v":0},{"$f":"'3. Budget - Work Plan'!F9","v":0},{"$f":"'3. Budget - Work Plan'!G9","v":0},null,null,null,0]
[{"$f":"'3. Budget - Work Plan'!A10:C10","v":"[Add task description here]"},null,null,{"$f":"'3. Budget - Work Plan'!D10","v":0},{"$f":"'3. Budget - Work Plan'!E10","v":0},{"$f":"'3. Budget - Work Plan'!F10","v":0},{"$f":"'3. Budget - Work Plan'!G10","v":0},null,null,null,0]
[{"$f":"'3. Budget - Work Plan'!A11:C11","v":"[Add task description here]"},null,null,{"$f":"'3. Budget - Work Plan'!D11","v":0},{"$f":"'3. Budget - Work Plan'!E11","v":0},{"$f":"'3. Budget - Work Plan'!F11","v":0},{"$f":"'3. Budget - Work Plan'!G11","v":0},null,null,null,0]
[{"$f":"'3. Budget - Work Plan'!A12:C12","v":"[Add task description here]"},null,null,{"$f":"'3. Budget - Work Plan'!D12","v":0},{"$f":"'3. Budget - Work Plan'!E12","v":0},{"$f":"'3. Budget - Work Plan'!F12","v":0},{"$f":"'3. Budget - Work Plan'!G12","v":0},null,null,null,0]
[{"$f":"'3. Budget - Work Plan'!A13:C13","v":"[Add task description here]"},null,null,{"$f":"'3. Budget - Work Plan'!D13","v":0},{"$f":"'3. Budget - Work Plan'!E13","v":0},{"$f":"'3. Budget - Work Plan'!F13","v":0},{"$f":"'3. Budget - Work Plan'!G13","v":0},null,null,null,0]
[{"$f":"'3. Budget - Work Plan'!A14:C14","v":"[Add task description here]"},null,null,{"$f":"'3. Budget - Work Plan'!D14","v":0},{"$f":"'3. Budget - Work Plan'!E14","v":0},{"$f":"'3. Budget - Work Plan'!F14","v":0},{"$f":"'3. Budget - Work Plan'!G14","v":0},null,null,null,0]
[{"$f":"'3. Budget - Work Plan'!A15:C15","v":"[Add task description here]"},null,null,{"$f":"'3. Budget - Work Plan'!D15","v":0},{"$f":"'3. Budget - Work Plan'!E15","v":0},{"$f":"'3. Budget - Work Plan'!F15","v":0},{"$f":"'3. Budget - Work Plan'!G15","v":0},null,null,null,0]
[{"$f":"'3. Budget - Work Plan'!A16:C16","v":"[Add task description here]"},null,null,{"$f":"'3. Budget - Work Plan'!D16","v":0},{"$f":"'3. Budget - Work Plan'!E16","v":0},{"$f":"'3. Budget - Work Plan'!F16","v":0},{"$f":"'3. Budget - Work Plan'!G16","v":0},null,null,null,0]
[{"$f":"'3. Budget - Work Plan'!A17:C17","v":"[Add task description here]"},null,null,{"$f":"'3. Budget - Work Plan'!D17","v":0},{"$f":"'3. Budget - Work Plan'!E17","v":0},{"$f":"'3. Budget - Work Plan'!F17","v":0},{"$f":"'3. Budget - Work Plan'!G17","v":0},null,null,null,0]
[{"$f":"'3. Budget - Work Plan'!A18:C18","v":"[Add task description here]"},null,null,{"$f":"'3. Budget - Work Plan'!D18","v":0},{"$f":"'3. Budget - Work Plan'!E18","v":0},{"$f":"'3. Budget - Work Plan'!F18","v":0},{"$f":"'3. Budget - Work Plan'!G18","v":0},null,null,null,0]
[{"$f":"'3. Budget - Work Plan'!A19:C19","v":"[Add task description here]"},null,null,{"$f":"'3. Budget - Work Plan'!D19","v":0},{"$f":"'3. Budget - Work Plan'!E19","v":0},{"$f":"'3. Budget - Work Plan'!F19","v":0},{"$f":"'3. Budget - Work Plan'!G19","v":0},null,null,null,0]
[{"$f":"'3. Budget - Work Plan'!A20:C20","v":"[Add task description here]"},null,null,{"$f":"'3. Budget - Work Plan'!D20","v":0},{"$f":"'3. Budget - Work Plan'!E20","v":0},{"$f":"'3. Budget - Work Plan'!F20","v":0},{"$f":"'3. Budget - Work Plan'!G20","v":0},null,null,null,0]
[{"$f":"'3. Budget - Work Plan'!A21:C21","v":"[Add task description here]"},null,null,{"$f":"'3. Budget - Work Plan'!D21","v":0},{"$f":"'3. Budget - Work Plan'!E21","v":0},{"$f":"'3. Budget - Work Plan'!F21","v":0},{"$f":"'3. Budget - Work Plan'!G21","v":0},null,null,null,0]
[{"$f":"'3. Budget - Work Plan'!A22:C22","v":"[Add task description here]"},null,null,{"$f":"'3. Budget - Work Plan'!D22","v":0},{"$f":"'3. Budget - Work Plan'!E22","v":0},{"$f":"'3. Budget - Work Plan'!F22","v":0},{"$f":"'3. Budget - Work Plan'!G22","v":0},null,null,null,0]
["Subtotal",null,null,null,{"$f":"'3. Budget - Work Plan'!E23","v":0},{"$f":"'3. Budget - Work Plan'!F23","v":0},{"$f":"'3. Budget - Work Plan'!G23","v":0},null,{"$f":"SUM(I8:I23)","v":0},{"$f":"SUM(J8:J23)","v":0},0]
[{"$f":"'3. Budget - Work Plan'!A24","v":"Milestone 2: Please identify your second milestone"},{"$f":"'3. Budget - Work Plan'!B24","v":"mm/yyyy"},{"$f":"'3. Budget - Work Plan'!C24","v":"mm/yyyy"}]
[{"$f":"'3. Budget - Work Plan'!A25","v":"Milestone description: [In this box, please describe the milestone or the major deliverable that indicates the completion of this milestone]"}]
[{"$f":"'3. Budget - Work Plan'!A26:C26","v":"[Add task description here]"},null,null,{"$f":"'3. Budget - Work Plan'!D26","v":0},{"$f":"'3. Budget - Work Plan'!E26","v":0},{"$f":"'3. Budget - Work Plan'!F26","v":0},{"$f":"'3. Budget - Work Plan'!G26","v":0},null,null,null,{"$f":"I27+J27","v":0}]
[{"$f":"'3. Budget - Work Plan'!A27:C27","v":"[Add task description here]"},null,null,{"$f":"'3. Budget - Work Plan'!D27","v":0},{"$f":"'3. Budget - Work Plan'!E27","v":0},{"$f":"'3. Budget - Work Plan'!F27","v":0},{"$f":"'3. Budget - Work Plan'!G27","v":0},null,null,null,{"$f":"I28+J28","v":0}]
[{"$f":"'3. Budget - Work Plan'!A28:C28","v":"[Add task description here]"},null,null,{"$f":"'3. Budget - Work Plan'!D28","v":0},{"$f":"'3. Budget - Work Plan'!E28","v":0},{"$f":"'3. Budget - Work Plan'!F28","v":0},{"$f":"'3. Budget - Work Plan'!G28","v":0},null,null,null,0]
[{"$f":"'3. Budget - Work Plan'!A29:C29","v":"[Add task description here]"},null,null,{"$f":"'3. Budget - Work Plan'!D29","v":0},{"$f":"'3. Budget - Work Plan'!E29","v":0},{"$f":"'3. Budget - Work Plan'!F29","v":0},{"$f":"'3. Budget - Work Plan'!G29","v":0},null,null,null,0]
{"$rows_left_out":111}